{"text_format":"1","workbook":"xlsx","n_sheets":8,"sheets":["Feuil1","Feuil2","Tableau_de_bord","Module_1","Module_2","Decodage","Etape_2","parametrage"],"not_rendered":{"charts":2,"images":2,"macros":1,"external_links":0,"defined_names":10,"comments":0,"pivot_tables":0},"unopened":[],"bounds":{"document_bytes":16777216,"sheet_cells":100000,"rows_first":2000,"rows_last":500,"rows_between":2000,"halvings":0,"cell_chars":16384,"cell_head_chars":4096},"cells_cut":0,"cells_raw":0,"read":"whole","date_system":"1900"}

{"sheet":"Feuil1","index":0,"n_rows":0,"n_cols":0,"rows_kept":0,"cut":false,"hidden":false,"merged":[]}

{"sheet":"Feuil2","index":1,"n_rows":0,"n_cols":0,"rows_kept":0,"cut":false,"hidden":true,"merged":[]}

{"sheet":"Tableau_de_bord","index":2,"n_rows":22,"n_cols":2,"rows_kept":22,"cut":false,"hidden":false,"merged":[]}
["Département :","قسم : علوم مالية و محاسبة"]
["Filière et spécialité :","تخصص: محاسبة و تدقيق"]
["Président CFD :","د/ فنغور عبدالسلام"]
["Membres CFD :","د/ رحال علي"]
["Membres CFD :","د/ يحياوي نعيمة"]
["Membres CFD :","د/ عبدالصمد نجوى"]
["Membres CFD :","د/ سي محمد لخضر"]
["corr"]
[]
[]
["Membres CFD :","د/ بروال بومدين"]
["Membres CFD :","د/ عيساني عامر"]
["Président du CSD :","د/ خدومة الوردي"]
["Président du CSI :","د/ زموري مسعود"]
["Chef du Département :","د/ لوشن محمد"]
["Directeur adjoint chargé PG & RS :","د/ بوعبيد ميلود"]
["Directeur de l'Institut","د/ هارون الطاهر"]
["Directeur adjoint chargé des RELEX"]
["Modules 1 :","مقياس 1 : محاسبة مالية معمقة"]
["Modules 2 :","مقياس 2 : تدقيق محاسبي"]
["Lieu et date (Etape 1) : "]
["Lieu et date (Etape 2) : ","باتنة في02 نوفمبر2019"]

{"sheet":"Module_1","index":3,"n_rows":47,"n_cols":6,"rows_kept":47,"cut":false,"hidden":false,"merged":[[0,0,0,5]]}
[{"$f":"Tableau_de_bord!B19","v":"مقياس 1 : محاسبة مالية معمقة"}]
[]
["Module_1","Correction_1","Correction_2","Obs.","Correction_3","Note"]
["A50",5,3,{"$f":"IF(ABS(B4-C4)>=3,\"3ème Correction\",\" \")","v":" "},null,{"$f":"IF(ABS(B4-C4)<3,AVERAGE(B4,C4),IF(SKEW(B4,C4,E4)=0,(SUM(B4,C4,E4)-MIN(B4,C4,E4))/2,IF(SKEW(B4,C4,E4)>0,(MIN(B4,C4,E4)+MEDIAN(B4,C4,E4))/2,(MAX(B4,C4,E4)+MEDIAN(B4,C4,E4))/2)))","v":4}]
["A51",4,4.25,{"$f":"IF(ABS(B5-C5)>=3,\"3ème Correction\",\" \")","v":" "},null,{"$f":"IF(ABS(B5-C5)<3,AVERAGE(B5,C5),IF(SKEW(B5,C5,E5)=0,(SUM(B5,C5,E5)-MIN(B5,C5,E5))/2,IF(SKEW(B5,C5,E5)>0,(MIN(B5,C5,E5)+MEDIAN(B5,C5,E5))/2,(MAX(B5,C5,E5)+MEDIAN(B5,C5,E5))/2)))","v":4.125}]
["A52",3,2.25," ",null,2.625]
["A53",6.75,4," ",null,5.375]
["A54",3,3," ",null,3]
["A55",2.5,2.25," ",null,2.375]
["A56",6,5.25," ",null,5.625]
["A57",2.5,2.5," ",null,2.5]
["A58",8,7.25," ",null,7.625]
["A59",2.5,3," ",null,2.75]
["A60",1.5,2," ",null,1.75]
["A61",4.5,4.5,{"$f":"IF(ABS(B15-C15)>=3,\"3ème Correction\",\" \")","v":" "},null,4.5]
["A62",2,2.5," ",null,2.25]
["A63",2.5,3," ",null,2.75]
["A64",3.25,3," ",null,3.125]
["A65",4.5,3," ",null,3.75]
["A66",2,2," ",null,2]
["A67",0.5,3," ",null,1.75]
["A68",1,2.75," ",null,1.875]
["A69",3,4.5," ",null,3.75]
["A70",1.5,1.5," ",null,1.5]
["A71",3.75,4.25," ",null,4]
["A72",6.75,9," ",null,7.875]
["A73",2,2," ",null,2]
["A74",2,2," ",null,2]
["A75",2.75,3.5," ",null,3.125]
["A76",2.5,1," ",null,1.75]
["A77",2.5,5," ",null,3.75]
["A78",2.25,1.5," ",null,1.875]
["A79",2.5,2.5," ",null,2.5]
["A80",0,1," ",null,0.5]
["A81",2,1," ",null,1.5]
["A82",2.5,1.5," ",null,2]
["A83",2,0.5," ",null,1.25]
["A84",9,8," ",null,8.5]
["A85",1.5,1.5," ",null,1.5]
["A86",1,3," ",null,2]
{"$rows_left_out":8}
{"sheet":"Module_2","index":4,"n_rows":47,"n_cols":6,"rows_kept":47,"cut":false,"hidden":false,"merged":[[0,0,0,5]]}
[{"$f":"Tableau_de_bord!B20","v":"مقياس 2 : تدقيق محاسبي"}]
[]
["Module_1","Correction_1","Correction_2","Obs.","Correction_3","Note"]
["B01",6,7.5,{"$f":"IF(ABS(B4-C4)>=3,\"3ème Correction\",\" \")","v":" "},null,{"$f":"IF(ABS(B4-C4)<3,AVERAGE(B4,C4),IF(SKEW(B4,C4,E4)=0,(SUM(B4,C4,E4)-MIN(B4,C4,E4))/2,IF(SKEW(B4,C4,E4)>0,(MIN(B4,C4,E4)+MEDIAN(B4,C4,E4))/2,(MAX(B4,C4,E4)+MEDIAN(B4,C4,E4))/2)))","v":6.75}]
["B02",10,9,{"$f":"IF(ABS(B5-C5)>=3,\"3ème Correction\",\" \")","v":" "},null,9.5]
["B03",2.5,10,"3ème Correction",7.75,8.875]
["B04",2.5,5.5,"3ème Correction",2.75,2.625]
["B05",5.5,8.5,"3ème Correction",5,5.25]
["B06",8,9," ",null,8.5]
["B07",3.5,6.5,"3ème Correction",4,3.75]
["B08",10,9.5," ",null,9.75]
["B09",5,8,"3ème Correction",6.25,5.625]
["B10",4.5,3," ",null,3.75]
["B11",3,1.5," ",null,2.25]
["B12",6.5,4.5," ",null,5.5]
["B13",4.5,5," ",null,4.75]
["B14",7,3,"3ème Correction",3,3]
["B15",8,3,"3ème Correction",6,7]
["B16",3.5,1.75," ",null,2.625]
["B17",0.5,2," ",null,1.25]
["B18",5.25,5," ",null,5.125]
["B19",4,10.5,"3ème Correction",10.5,10.5]
["B20",2,4," ",null,3]
["B21",4.75,6," ",null,5.375]
["B22",5.75,2,"3ème Correction",4,4.875]
["B23",3.5,2.5," ",null,3]
["B24",8,6.5," ",null,7.25]
["B25",6.5,5.5," ",null,6]
["B26",5.75,4," ",null,4.875]
["B27",6.25,2.75,"3ème Correction",5,5.625]
["B28",10.75,7.5,"3ème Correction",8.5,8]
["B29",7,6," ",null,6.5]
["B30",7.5,5.5," ",null,6.5]
["B31",null,null," ",null,{"$error":"#DIV/0!"}]
["B32",4,2.25," ",null,3.125]
["B33",6.25,5," ",null,5.625]
["B34",4.5,3," ",null,3.75]
["B35",6.5,5," ",null,5.75]
["B36",9.25,8.5," ",null,8.875]
["B37",7.5,10," ",null,8.75]
{"$rows_left_out":8}
{"sheet":"Decodage","index":5,"n_rows":101,"n_cols":14,"rows_kept":101,"cut":false,"hidden":false,"merged":[]}
["N°","Nom ","prénom","Intitulé_Master","Annexe_A_B","Univ_origine","Code_1","Module_1","Code_2","Module_2","Moy","Pour le TRI","Licence","Obs."]
[94,"FATIMA ZOHRA","BOULAHBEL",null,null,null,"A58",{"$f":"IF($G2=\"\",\"غ\",VLOOKUP($G2,Module_1!$A$4:$F$47,6))","v":7.625},"B40",{"$f":"IF($I2=\"\",\"غ\",VLOOKUP($I2,Module_2!$A$4:$F$47,6))","v":9.125},{"$f":"IF(OR(H2=\"غ\",J2=\"غ\"),\"غ\",(H2+J2*3)/4)","v":8.75},{"$f":"IF($K2=\"غ\",0,$K2)","v":8.75},null,"ناجح (ة) "]
[67,"labbaz","mabrouk",null,null,null,"A75",{"$f":"IF($G3=\"\",\"غ\",VLOOKUP($G3,Module_1!$A$4:$F$47,6))","v":3.125},"B19",{"$f":"IF($I3=\"\",\"غ\",VLOOKUP($I3,Module_2!$A$4:$F$47,6))","v":10.5},8.65625,8.65625,null,"ناجح (ة) "]
[61,"ben azouaou","leila",null,null,null,"A61",{"$f":"IF($G4=\"\",\"غ\",VLOOKUP($G4,Module_1!$A$4:$F$47,6))","v":4.5},"B02",{"$f":"IF($I4=\"\",\"غ\",VLOOKUP($I4,Module_2!$A$4:$F$47,6))","v":9.5},8.25,8.25,null,"ناجح (ة) "]
[6,"Berchi","Nardjes",null,null,null,"A87",{"$f":"IF($G5=\"\",\"غ\",VLOOKUP($G5,Module_1!$A$4:$F$47,6))","v":2.25},"B08",{"$f":"IF($I5=\"\",\"غ\",VLOOKUP($I5,Module_2!$A$4:$F$47,6))","v":9.75},7.875,7.875,null,"راسب(ة)"]
[14,"salaouda","khaled",null,null,null,"A53",{"$f":"IF($G6=\"\",\"غ\",VLOOKUP($G6,Module_1!$A$4:$F$47,6))","v":5.375},"B06",{"$f":"IF($I6=\"\",\"غ\",VLOOKUP($I6,Module_2!$A$4:$F$47,6))","v":8.5},7.71875,7.71875,null,"راسب(ة)"]
[86,"saidi","sabah",null,null,null,"A51",{"$f":"IF($G7=\"\",\"غ\",VLOOKUP($G7,Module_1!$A$4:$F$47,6))","v":4.125},"B03",{"$f":"IF($I7=\"\",\"غ\",VLOOKUP($I7,Module_2!$A$4:$F$47,6))","v":8.875},7.6875,7.6875,null,"راسب(ة)"]
[76,"boultiah","salima",null,null,null,"A64",{"$f":"IF($G8=\"\",\"غ\",VLOOKUP($G8,Module_1!$A$4:$F$47,6))","v":3.125},"B36",{"$f":"IF($I8=\"\",\"غ\",VLOOKUP($I8,Module_2!$A$4:$F$47,6))","v":8.875},7.4375,7.4375,null,"راسب(ة)"]
[35,"djemmal","hamza oulid",null,null,null,"A89",{"$f":"IF($G9=\"\",\"غ\",VLOOKUP($G9,Module_1!$A$4:$F$47,6))","v":2.375},"B37",{"$f":"IF($I9=\"\",\"غ\",VLOOKUP($I9,Module_2!$A$4:$F$47,6))","v":8.75},7.15625,7.15625,null,"راسب(ة)"]
[13,"TLALES","Azouz",null,null,null,"A63",{"$f":"IF($G10=\"\",\"غ\",VLOOKUP($G10,Module_1!$A$4:$F$47,6))","v":2.75},"B44",{"$f":"IF($I10=\"\",\"غ\",VLOOKUP($I10,Module_2!$A$4:$F$47,6))","v":8.5},7.0625,7.0625,null,"راسب(ة)"]
[53,"Djaroun","Sorya",null,null,null,"A56",{"$f":"IF($G11=\"\",\"غ\",VLOOKUP($G11,Module_1!$A$4:$F$47,6))","v":5.625},"B24",{"$f":"IF($I11=\"\",\"غ\",VLOOKUP($I11,Module_2!$A$4:$F$47,6))","v":7.25},6.84375,6.84375,null,"راسب(ة)"]
[43,"bouzidi","abdelwahab",null,null,null,"A86",{"$f":"IF($G12=\"\",\"غ\",VLOOKUP($G12,Module_1!$A$4:$F$47,6))","v":2},"B38",{"$f":"IF($I12=\"\",\"غ\",VLOOKUP($I12,Module_2!$A$4:$F$47,6))","v":8},6.5,6.5,null,"راسب(ة)"]
[19,"Guidoum","Aicha",null,null,null,"A93",{"$f":"IF($G13=\"\",\"غ\",VLOOKUP($G13,Module_1!$A$4:$F$47,6))","v":2},"B28",{"$f":"IF($I13=\"\",\"غ\",VLOOKUP($I13,Module_2!$A$4:$F$47,6))","v":8},6.5,6.5,null,"راسب(ة)"]
[45,"ABIDI","IBTISSEM",null,null,null,"A84",{"$f":"IF($G14=\"\",\"غ\",VLOOKUP($G14,Module_1!$A$4:$F$47,6))","v":8.5},"B09",{"$f":"IF($I14=\"\",\"غ\",VLOOKUP($I14,Module_2!$A$4:$F$47,6))","v":5.625},6.34375,6.34375,null,"راسب(ة)"]
[51,"DERRADJI","AMEL NOUR EL HOUDA",null,null,null,"A66",{"$f":"IF($G15=\"\",\"غ\",VLOOKUP($G15,Module_1!$A$4:$F$47,6))","v":2},"B43",{"$f":"IF($I15=\"\",\"غ\",VLOOKUP($I15,Module_2!$A$4:$F$47,6))","v":7.5},6.125,6.125,null,"راسب(ة)"]
[60,"Sadoun","Moussa",null,null,null,"A59",{"$f":"IF($G16=\"\",\"غ\",VLOOKUP($G16,Module_1!$A$4:$F$47,6))","v":2.75},"B39",{"$f":"IF($I16=\"\",\"غ\",VLOOKUP($I16,Module_2!$A$4:$F$47,6))","v":7.25},6.125,6.125,null,"راسب(ة)"]
[33,"guerziz","meriem",null,null,null,"A72",{"$f":"IF($G17=\"\",\"غ\",VLOOKUP($G17,Module_1!$A$4:$F$47,6))","v":7.875},"B21",{"$f":"IF($I17=\"\",\"غ\",VLOOKUP($I17,Module_2!$A$4:$F$47,6))","v":5.375},6,6,null,"راسب(ة)"]
[31,"ARIOUA","MOHAMED",null,null,null,"A92",{"$f":"IF($G18=\"\",\"غ\",VLOOKUP($G18,Module_1!$A$4:$F$47,6))","v":2.125},"B15",{"$f":"IF($I18=\"\",\"غ\",VLOOKUP($I18,Module_2!$A$4:$F$47,6))","v":7},5.78125,5.78125,null,"راسب(ة)"]
[92,"TALEB","ISSAM",null,null,null,"A55",{"$f":"IF($G19=\"\",\"غ\",VLOOKUP($G19,Module_1!$A$4:$F$47,6))","v":2.375},"B01",{"$f":"IF($I19=\"\",\"غ\",VLOOKUP($I19,Module_2!$A$4:$F$47,6))","v":6.75},5.65625,5.65625,null,"راسب(ة)"]
[73,"LITIM","IKRAM",null,null,null,"A62",{"$f":"IF($G20=\"\",\"غ\",VLOOKUP($G20,Module_1!$A$4:$F$47,6))","v":2.25},"B41",{"$f":"IF($I20=\"\",\"غ\",VLOOKUP($I20,Module_2!$A$4:$F$47,6))","v":6.75},5.625,5.625,null,"راسب(ة)"]
[5,"bouchouk","noura",null,null,null,"A73",{"$f":"IF($G21=\"\",\"غ\",VLOOKUP($G21,Module_1!$A$4:$F$47,6))","v":2},"B30",{"$f":"IF($I21=\"\",\"غ\",VLOOKUP($I21,Module_2!$A$4:$F$47,6))","v":6.5},5.375,5.375,null,"راسب(ة)"]
[58,"guemida","assia",null,null,null,"A60",{"$f":"IF($G22=\"\",\"غ\",VLOOKUP($G22,Module_1!$A$4:$F$47,6))","v":1.75},"B29",{"$f":"IF($I22=\"\",\"غ\",VLOOKUP($I22,Module_2!$A$4:$F$47,6))","v":6.5},5.3125,5.3125,null,"راسب(ة)"]
[38,"guerfi","ilyes",null,null,null,"A50",{"$f":"IF($G23=\"\",\"غ\",VLOOKUP($G23,Module_1!$A$4:$F$47,6))","v":4},"B35",{"$f":"IF($I23=\"\",\"غ\",VLOOKUP($I23,Module_2!$A$4:$F$47,6))","v":5.75},5.3125,5.3125,null,"راسب(ة)"]
[10,"meddour","imen",null,null,null,"A71",{"$f":"IF($G24=\"\",\"غ\",VLOOKUP($G24,Module_1!$A$4:$F$47,6))","v":4},"B27",{"$f":"IF($I24=\"\",\"غ\",VLOOKUP($I24,Module_2!$A$4:$F$47,6))","v":5.625},5.21875,5.21875,null,"راسب(ة)"]
[78,"YAHIAOUI","Asma",null,null,null,"A79",{"$f":"IF($G25=\"\",\"غ\",VLOOKUP($G25,Module_1!$A$4:$F$47,6))","v":2.5},"B25",{"$f":"IF($I25=\"\",\"غ\",VLOOKUP($I25,Module_2!$A$4:$F$47,6))","v":6},5.125,5.125,null,"راسب(ة)"]
[37,"bouaziz ","mouldia  ",null,null,null,"A77",{"$f":"IF($G26=\"\",\"غ\",VLOOKUP($G26,Module_1!$A$4:$F$47,6))","v":3.75},"B05",{"$f":"IF($I26=\"\",\"غ\",VLOOKUP($I26,Module_2!$A$4:$F$47,6))","v":5.25},4.875,4.875,null,"راسب(ة)"]
[77,"bassaid","hafied",null,null,null,"A74",{"$f":"IF($G27=\"\",\"غ\",VLOOKUP($G27,Module_1!$A$4:$F$47,6))","v":2},"B12",{"$f":"IF($I27=\"\",\"غ\",VLOOKUP($I27,Module_2!$A$4:$F$47,6))","v":5.5},4.625,4.625,null,"راسب(ة)"]
[95,"AROUL","Turkia",null,null,null,"A90",{"$f":"IF($G28=\"\",\"غ\",VLOOKUP($G28,Module_1!$A$4:$F$47,6))","v":0.625},"B33",{"$f":"IF($I28=\"\",\"غ\",VLOOKUP($I28,Module_2!$A$4:$F$47,6))","v":5.625},4.375,4.375,null,"راسب(ة)"]
[88,"saadi","kenza",null,null,null,"A65",{"$f":"IF($G29=\"\",\"غ\",VLOOKUP($G29,Module_1!$A$4:$F$47,6))","v":3.75},"B42",{"$f":"IF($I29=\"\",\"غ\",VLOOKUP($I29,Module_2!$A$4:$F$47,6))","v":4.5},4.3125,4.3125,null,"راسب(ة)"]
[91,"Bellakh","Sihem",null,null,null,"A67",{"$f":"IF($G30=\"\",\"غ\",VLOOKUP($G30,Module_1!$A$4:$F$47,6))","v":1.75},"B18",{"$f":"IF($I30=\"\",\"غ\",VLOOKUP($I30,Module_2!$A$4:$F$47,6))","v":5.125},4.28125,4.28125,null,"راسب(ة)"]
[27,"zeyneb","tamrabet",null,null,null,"A68",{"$f":"IF($G31=\"\",\"غ\",VLOOKUP($G31,Module_1!$A$4:$F$47,6))","v":1.875},"B26",{"$f":"IF($I31=\"\",\"غ\",VLOOKUP($I31,Module_2!$A$4:$F$47,6))","v":4.875},4.125,4.125,null,"راسب(ة)"]
[57,"kebab","ghania",null,null,null,"A85",{"$f":"IF($G32=\"\",\"غ\",VLOOKUP($G32,Module_1!$A$4:$F$47,6))","v":1.5},"B22",{"$f":"IF($I32=\"\",\"غ\",VLOOKUP($I32,Module_2!$A$4:$F$47,6))","v":4.875},4.03125,4.03125,null,"راسب(ة)"]
[72,"maalem","abir",null,null,null,"A88",{"$f":"IF($G33=\"\",\"غ\",VLOOKUP($G33,Module_1!$A$4:$F$47,6))","v":1.25},"B13",{"$f":"IF($I33=\"\",\"غ\",VLOOKUP($I33,Module_2!$A$4:$F$47,6))","v":4.75},3.875,3.875,null,"راسب(ة)"]
[71,"djelal","lamis",null,null,null,"A69",{"$f":"IF($G34=\"\",\"غ\",VLOOKUP($G34,Module_1!$A$4:$F$47,6))","v":3.75},"B10",{"$f":"IF($I34=\"\",\"غ\",VLOOKUP($I34,Module_2!$A$4:$F$47,6))","v":3.75},{"$f":"IF(OR(H34=\"غ\",J34=\"غ\"),\"غ\",(H34+J34*3)/4)","v":3.75},{"$f":"IF($K34=\"غ\",0,$K34)","v":3.75},null,"راسب(ة)"]
[42,"DERDOUBA","ABDELHAK",null,null,null,"A52",{"$f":"IF($G35=\"\",\"غ\",VLOOKUP($G35,Module_1!$A$4:$F$47,6))","v":2.625},"B07",{"$f":"IF($I35=\"\",\"غ\",VLOOKUP($I35,Module_2!$A$4:$F$47,6))","v":3.75},3.46875,3.46875,null,"راسب(ة)"]
[84,"bouradi","maroua",null,null,null,"A78",{"$f":"IF($G36=\"\",\"غ\",VLOOKUP($G36,Module_1!$A$4:$F$47,6))","v":1.875},"B34",{"$f":"IF($I36=\"\",\"غ\",VLOOKUP($I36,Module_2!$A$4:$F$47,6))","v":3.75},3.28125,3.28125,null,"راسب(ة)"]
[9,"ATHAMNIA","Abd El Azize",null,null,null,"A57",{"$f":"IF($G37=\"\",\"غ\",VLOOKUP($G37,Module_1!$A$4:$F$47,6))","v":2.5},"B23",{"$f":"IF($I37=\"\",\"غ\",VLOOKUP($I37,Module_2!$A$4:$F$47,6))","v":3},2.875,2.875,null,"راسب(ة)"]
[80,"BEKIRI","HADJER",null,null,null,"A54",{"$f":"IF($G38=\"\",\"غ\",VLOOKUP($G38,Module_1!$A$4:$F$47,6))","v":3},"B04",{"$f":"IF($I38=\"\",\"غ\",VLOOKUP($I38,Module_2!$A$4:$F$47,6))","v":2.625},2.71875,2.71875,null,"راسب(ة)"]
[81,"BENABBES","RAYENE",null,null,null,"A91",{"$f":"IF($G39=\"\",\"غ\",VLOOKUP($G39,Module_1!$A$4:$F$47,6))","v":1.125},"B32",{"$f":"IF($I39=\"\",\"غ\",VLOOKUP($I39,Module_2!$A$4:$F$47,6))","v":3.125},2.625,2.625,null,"راسب(ة)"]
[55,"BOUDJELAL","MOUNA",null,null,null,"A70",{"$f":"IF($G40=\"\",\"غ\",VLOOKUP($G40,Module_1!$A$4:$F$47,6))","v":1.5},"B14",{"$f":"IF($I40=\"\",\"غ\",VLOOKUP($I40,Module_2!$A$4:$F$47,6))","v":3},2.625,2.625,null,"راسب(ة)"]
{"$rows_left_out":62}
{"sheet":"Etape_2","index":6,"n_rows":145,"n_cols":10,"rows_kept":145,"cut":false,"hidden":false,"merged":[[127,6,127,9],[128,6,128,9],[97,0,97,5],[98,0,98,5],[98,6,98,9],[99,6,99,9],[100,4,100,5],[100,0,100,2],[100,6,100,9],[101,0,101,2],[102,0,102,2],[103,0,103,2],[104,0,104,2],[127,0,127,3],[6,0,6,9],[8,0,8,9],[10,0,11,0],[10,2,11,2],[10,8,11,8],[10,9,11,9],[10,1,11,1],[5,0,5,9],[0,0,0,9],[1,0,1,9],[2,0,2,8],[3,0,3,9],[4,0,4,9],[138,6,138,9],[105,0,105,2],[106,0,106,2],[108,0,108,3],[109,0,109,3],[108,6,108,9],[109,6,109,9],[118,6,118,9],[118,0,118,3],[119,6,119,9],[119,0,119,3],[120,0,120,3],[126,0,126,3],[126,6,126,9],[137,0,137,3],[129,6,129,9]]}
["جامعة الحاج لخضر -باتنة01"]
[{"$f":"Tableau_de_bord!B1","v":"قسم : علوم مالية و محاسبة"}]
[]
["النتائج النهائية للمسابقة الوطنية للدخول إلى السنة الأولى دكتوراه (LMD)"]
[]
[{"$f":"Tableau_de_bord!B2","v":"تخصص: محاسبة و تدقيق"}]
["السنة الجامعية : 2020/2019"]
[]
["النتائج النهائية حسب القرار رقم 547 المورخ في 2016/06/02 - المرحلة النهائية"]
[]
["الترتيب","اللقبـــــــــــ ","الإســـــــــــم","نوع","صنف","الجامعة","مقياس 1","مقياس 2","المعدل","ملاحظات"]
[null,null,null,"الماستر","الترتيب","الأصلية","معامل : 01","معامل : 03"]
[1,{"$f":"Decodage!B2","v":"FATIMA ZOHRA"},{"$f":"Decodage!C2","v":"BOULAHBEL"},{"$f":"Decodage!D2","v":0},{"$f":"Decodage!E2","v":0},{"$f":"Decodage!F2","v":0},{"$f":"Decodage!H2","v":7.625},{"$f":"Decodage!J2","v":9.125},{"$f":"Decodage!K2","v":8.75},{"$f":"Decodage!N2","v":"ناجح (ة) "}]
[2,{"$f":"Decodage!B3","v":"labbaz"},{"$f":"Decodage!C3","v":"mabrouk"},{"$f":"Decodage!D3","v":0},{"$f":"Decodage!E3","v":0},{"$f":"Decodage!F3","v":0},{"$f":"Decodage!H3","v":3.125},{"$f":"Decodage!J3","v":10.5},{"$f":"Decodage!K3","v":8.65625},{"$f":"Decodage!N3","v":"ناجح (ة) "}]
[3,{"$f":"Decodage!B4","v":"ben azouaou"},{"$f":"Decodage!C4","v":"leila"},{"$f":"Decodage!D4","v":0},{"$f":"Decodage!E4","v":0},{"$f":"Decodage!F4","v":0},{"$f":"Decodage!H4","v":4.5},{"$f":"Decodage!J4","v":9.5},{"$f":"Decodage!K4","v":8.25},{"$f":"Decodage!N4","v":"ناجح (ة) "}]
[4,{"$f":"Decodage!B5","v":"Berchi"},{"$f":"Decodage!C5","v":"Nardjes"},{"$f":"Decodage!D5","v":0},{"$f":"Decodage!E5","v":0},{"$f":"Decodage!F5","v":0},{"$f":"Decodage!H5","v":2.25},{"$f":"Decodage!J5","v":9.75},{"$f":"Decodage!K5","v":7.875},{"$f":"Decodage!N5","v":"راسب(ة)"}]
[5,{"$f":"Decodage!B6","v":"salaouda"},{"$f":"Decodage!C6","v":"khaled"},{"$f":"Decodage!D6","v":0},{"$f":"Decodage!E6","v":0},{"$f":"Decodage!F6","v":0},{"$f":"Decodage!H6","v":5.375},{"$f":"Decodage!J6","v":8.5},{"$f":"Decodage!K6","v":7.71875},{"$f":"Decodage!N6","v":"راسب(ة)"}]
[6,{"$f":"Decodage!B7","v":"saidi"},{"$f":"Decodage!C7","v":"sabah"},{"$f":"Decodage!D7","v":0},{"$f":"Decodage!E7","v":0},{"$f":"Decodage!F7","v":0},{"$f":"Decodage!H7","v":4.125},{"$f":"Decodage!J7","v":8.875},{"$f":"Decodage!K7","v":7.6875},{"$f":"Decodage!N7","v":"راسب(ة)"}]
[7,{"$f":"Decodage!B8","v":"boultiah"},{"$f":"Decodage!C8","v":"salima"},{"$f":"Decodage!D8","v":0},{"$f":"Decodage!E8","v":0},{"$f":"Decodage!F8","v":0},{"$f":"Decodage!H8","v":3.125},{"$f":"Decodage!J8","v":8.875},{"$f":"Decodage!K8","v":7.4375},{"$f":"Decodage!N8","v":"راسب(ة)"}]
[8,{"$f":"Decodage!B9","v":"djemmal"},{"$f":"Decodage!C9","v":"hamza oulid"},{"$f":"Decodage!D9","v":0},{"$f":"Decodage!E9","v":0},{"$f":"Decodage!F9","v":0},{"$f":"Decodage!H9","v":2.375},{"$f":"Decodage!J9","v":8.75},{"$f":"Decodage!K9","v":7.15625},{"$f":"Decodage!N9","v":"راسب(ة)"}]
[9,{"$f":"Decodage!B10","v":"TLALES"},{"$f":"Decodage!C10","v":"Azouz"},{"$f":"Decodage!D10","v":0},{"$f":"Decodage!E10","v":0},{"$f":"Decodage!F10","v":0},{"$f":"Decodage!H10","v":2.75},{"$f":"Decodage!J10","v":8.5},{"$f":"Decodage!K10","v":7.0625},{"$f":"Decodage!N10","v":"راسب(ة)"}]
[10,{"$f":"Decodage!B11","v":"Djaroun"},{"$f":"Decodage!C11","v":"Sorya"},{"$f":"Decodage!D11","v":0},{"$f":"Decodage!E11","v":0},{"$f":"Decodage!F11","v":0},{"$f":"Decodage!H11","v":5.625},{"$f":"Decodage!J11","v":7.25},{"$f":"Decodage!K11","v":6.84375},{"$f":"Decodage!N11","v":"راسب(ة)"}]
[11,{"$f":"Decodage!B12","v":"bouzidi"},{"$f":"Decodage!C12","v":"abdelwahab"},{"$f":"Decodage!D12","v":0},{"$f":"Decodage!E12","v":0},{"$f":"Decodage!F12","v":0},{"$f":"Decodage!H12","v":2},{"$f":"Decodage!J12","v":8},{"$f":"Decodage!K12","v":6.5},{"$f":"Decodage!N12","v":"راسب(ة)"}]
[12,{"$f":"Decodage!B13","v":"Guidoum"},{"$f":"Decodage!C13","v":"Aicha"},{"$f":"Decodage!D13","v":0},{"$f":"Decodage!E13","v":0},{"$f":"Decodage!F13","v":0},{"$f":"Decodage!H13","v":2},{"$f":"Decodage!J13","v":8},{"$f":"Decodage!K13","v":6.5},{"$f":"Decodage!N13","v":"راسب(ة)"}]
[13,{"$f":"Decodage!B14","v":"ABIDI"},{"$f":"Decodage!C14","v":"IBTISSEM"},{"$f":"Decodage!D14","v":0},{"$f":"Decodage!E14","v":0},{"$f":"Decodage!F14","v":0},{"$f":"Decodage!H14","v":8.5},{"$f":"Decodage!J14","v":5.625},{"$f":"Decodage!K14","v":6.34375},{"$f":"Decodage!N14","v":"راسب(ة)"}]
[14,{"$f":"Decodage!B15","v":"DERRADJI"},{"$f":"Decodage!C15","v":"AMEL NOUR EL HOUDA"},{"$f":"Decodage!D15","v":0},{"$f":"Decodage!E15","v":0},{"$f":"Decodage!F15","v":0},{"$f":"Decodage!H15","v":2},{"$f":"Decodage!J15","v":7.5},{"$f":"Decodage!K15","v":6.125},{"$f":"Decodage!N15","v":"راسب(ة)"}]
[15,{"$f":"Decodage!B16","v":"Sadoun"},{"$f":"Decodage!C16","v":"Moussa"},{"$f":"Decodage!D16","v":0},{"$f":"Decodage!E16","v":0},{"$f":"Decodage!F16","v":0},{"$f":"Decodage!H16","v":2.75},{"$f":"Decodage!J16","v":7.25},{"$f":"Decodage!K16","v":6.125},{"$f":"Decodage!N16","v":"راسب(ة)"}]
[16,{"$f":"Decodage!B17","v":"guerziz"},{"$f":"Decodage!C17","v":"meriem"},{"$f":"Decodage!D17","v":0},{"$f":"Decodage!E17","v":0},{"$f":"Decodage!F17","v":0},{"$f":"Decodage!H17","v":7.875},{"$f":"Decodage!J17","v":5.375},{"$f":"Decodage!K17","v":6},{"$f":"Decodage!N17","v":"راسب(ة)"}]
[17,{"$f":"Decodage!B18","v":"ARIOUA"},{"$f":"Decodage!C18","v":"MOHAMED"},{"$f":"Decodage!D18","v":0},{"$f":"Decodage!E18","v":0},{"$f":"Decodage!F18","v":0},{"$f":"Decodage!H18","v":2.125},{"$f":"Decodage!J18","v":7},{"$f":"Decodage!K18","v":5.78125},{"$f":"Decodage!N18","v":"راسب(ة)"}]
[18,{"$f":"Decodage!B19","v":"TALEB"},{"$f":"Decodage!C19","v":"ISSAM"},{"$f":"Decodage!D19","v":0},{"$f":"Decodage!E19","v":0},{"$f":"Decodage!F19","v":0},{"$f":"Decodage!H19","v":2.375},{"$f":"Decodage!J19","v":6.75},{"$f":"Decodage!K19","v":5.65625},{"$f":"Decodage!N19","v":"راسب(ة)"}]
[19,{"$f":"Decodage!B20","v":"LITIM"},{"$f":"Decodage!C20","v":"IKRAM"},{"$f":"Decodage!D20","v":0},{"$f":"Decodage!E20","v":0},{"$f":"Decodage!F20","v":0},{"$f":"Decodage!H20","v":2.25},{"$f":"Decodage!J20","v":6.75},{"$f":"Decodage!K20","v":5.625},{"$f":"Decodage!N20","v":"راسب(ة)"}]
[20,{"$f":"Decodage!B21","v":"bouchouk"},{"$f":"Decodage!C21","v":"noura"},{"$f":"Decodage!D21","v":0},{"$f":"Decodage!E21","v":0},{"$f":"Decodage!F21","v":0},{"$f":"Decodage!H21","v":2},{"$f":"Decodage!J21","v":6.5},{"$f":"Decodage!K21","v":5.375},{"$f":"Decodage!N21","v":"راسب(ة)"}]
[21,{"$f":"Decodage!B22","v":"guemida"},{"$f":"Decodage!C22","v":"assia"},{"$f":"Decodage!D22","v":0},{"$f":"Decodage!E22","v":0},{"$f":"Decodage!F22","v":0},{"$f":"Decodage!H22","v":1.75},{"$f":"Decodage!J22","v":6.5},{"$f":"Decodage!K22","v":5.3125},{"$f":"Decodage!N22","v":"راسب(ة)"}]
[22,{"$f":"Decodage!B23","v":"guerfi"},{"$f":"Decodage!C23","v":"ilyes"},{"$f":"Decodage!D23","v":0},{"$f":"Decodage!E23","v":0},{"$f":"Decodage!F23","v":0},{"$f":"Decodage!H23","v":4},{"$f":"Decodage!J23","v":5.75},{"$f":"Decodage!K23","v":5.3125},{"$f":"Decodage!N23","v":"راسب(ة)"}]
[23,{"$f":"Decodage!B24","v":"meddour"},{"$f":"Decodage!C24","v":"imen"},{"$f":"Decodage!D24","v":0},{"$f":"Decodage!E24","v":0},{"$f":"Decodage!F24","v":0},{"$f":"Decodage!H24","v":4},{"$f":"Decodage!J24","v":5.625},{"$f":"Decodage!K24","v":5.21875},{"$f":"Decodage!N24","v":"راسب(ة)"}]
[24,{"$f":"Decodage!B25","v":"YAHIAOUI"},{"$f":"Decodage!C25","v":"Asma"},{"$f":"Decodage!D25","v":0},{"$f":"Decodage!E25","v":0},{"$f":"Decodage!F25","v":0},{"$f":"Decodage!H25","v":2.5},{"$f":"Decodage!J25","v":6},{"$f":"Decodage!K25","v":5.125},{"$f":"Decodage!N25","v":"راسب(ة)"}]
[25,{"$f":"Decodage!B26","v":"bouaziz "},{"$f":"Decodage!C26","v":"mouldia  "},{"$f":"Decodage!D26","v":0},{"$f":"Decodage!E26","v":0},{"$f":"Decodage!F26","v":0},{"$f":"Decodage!H26","v":3.75},{"$f":"Decodage!J26","v":5.25},{"$f":"Decodage!K26","v":4.875},{"$f":"Decodage!N26","v":"راسب(ة)"}]
[26,{"$f":"Decodage!B27","v":"bassaid"},{"$f":"Decodage!C27","v":"hafied"},{"$f":"Decodage!D27","v":0},{"$f":"Decodage!E27","v":0},{"$f":"Decodage!F27","v":0},{"$f":"Decodage!H27","v":2},{"$f":"Decodage!J27","v":5.5},{"$f":"Decodage!K27","v":4.625},{"$f":"Decodage!N27","v":"راسب(ة)"}]
[27,{"$f":"Decodage!B28","v":"AROUL"},{"$f":"Decodage!C28","v":"Turkia"},{"$f":"Decodage!D28","v":0},{"$f":"Decodage!E28","v":0},{"$f":"Decodage!F28","v":0},{"$f":"Decodage!H28","v":0.625},{"$f":"Decodage!J28","v":5.625},{"$f":"Decodage!K28","v":4.375},{"$f":"Decodage!N28","v":"راسب(ة)"}]
[28,{"$f":"Decodage!B29","v":"saadi"},{"$f":"Decodage!C29","v":"kenza"},{"$f":"Decodage!D29","v":0},{"$f":"Decodage!E29","v":0},{"$f":"Decodage!F29","v":0},{"$f":"Decodage!H29","v":3.75},{"$f":"Decodage!J29","v":4.5},{"$f":"Decodage!K29","v":4.3125},{"$f":"Decodage!N29","v":"راسب(ة)"}]
{"$rows_left_out":106}
{"sheet":"parametrage","index":7,"n_rows":3,"n_cols":9,"rows_kept":3,"cut":false,"hidden":false,"merged":[]}
["NOM","Mot de passe","Parametrage","Feuil1","Tableau_de_bord","Module_1","Module_2","Decodage","Etape_2"]
[111,111,"x","x","x","x","x","x","x"]
[111,111,"x","x","x","x","x","x","x"]